Reaction Details
TargetC-X-C chemokine receptor type 2
LigandBDBM50248337
Substrate/Competitorn/a
Meas. Tech.ChEMBL_566224 (CHEMBL963305)
Ki 7±n/a nM
Citation Biju, PTaveras, AGDwyer, MPYu, YChao, JHipkin, RWFan, XRindgen, DFine, JLundell, D Fluoroalkyl alpha side chain containing 3,4-diamino-cyclobutenediones as potent and orally bioavailable CXCR2-CXCR1 dual antagonists. Bioorg Med Chem Lett19:1431-3 (2009) 
 
C-X-C chemokine receptor type 2
Name:C-X-C chemokine receptor type 2
Type:Protein
Mol. Mass.:40767.88
Organism:Homo sapiens (Human)
Description:P25025
Residue:360
BDBM50248337
NameBDBM50248337
Synonyms:3-(2-((1S,2S)-2-fluoro-1-(furan-2-yl)propylamino)-3,4-dioxocyclobut-1-enylamino)-2-hydroxy-N,N-dimethylbenzamide | CHEMBL472749
TypeSmall organic molecule
Emp. Form.C20H20FN3O5
Mol. Mass.401.3883
SMILESC[C@H](F)[C@@H](Nc1c(Nc2cccc(C(=O)N(C)C)c2O)c(=O)c1=O)c1ccco1