Reaction Details
TargetC-X-C chemokine receptor type 2
LigandBDBM50248454
Substrate/Competitorn/a
Meas. Tech.ChEMBL_566224 (CHEMBL963305)
Ki 9±n/a nM
Citation Biju, PTaveras, AGDwyer, MPYu, YChao, JHipkin, RWFan, XRindgen, DFine, JLundell, D Fluoroalkyl alpha side chain containing 3,4-diamino-cyclobutenediones as potent and orally bioavailable CXCR2-CXCR1 dual antagonists. Bioorg Med Chem Lett19:1431-3 (2009) 
 
C-X-C chemokine receptor type 2
Name:C-X-C chemokine receptor type 2
Type:Protein
Mol. Mass.:40767.88
Organism:Homo sapiens (Human)
Description:P25025
Residue:360
BDBM50248454
NameBDBM50248454
Synonyms:(S)-3-(2-(2,2-difluoro-1-(5-methylfuran-2-yl)but-3-enylamino)-3,4-dioxocyclobut-1-enylamino)-2-hydroxy-N,N-dimethylbenzamide | CHEMBL491312
TypeSmall organic molecule
Emp. Form.C22H21F2N3O5
Mol. Mass.445.416
SMILESCN(C)C(=O)c1cccc(Nc2c(N[C@@H](c3ccc(C)o3)C(F)(F)C=C)c(=O)c2=O)c1O