Reaction Details
TargetC-X-C chemokine receptor type 2
LigandBDBM50248545
Substrate/Competitorn/a
Meas. Tech.ChEMBL_566224 (CHEMBL963305)
Ki 5±n/a nM
Citation Biju, PTaveras, AGDwyer, MPYu, YChao, JHipkin, RWFan, XRindgen, DFine, JLundell, D Fluoroalkyl alpha side chain containing 3,4-diamino-cyclobutenediones as potent and orally bioavailable CXCR2-CXCR1 dual antagonists. Bioorg Med Chem Lett19:1431-3 (2009) 
 
C-X-C chemokine receptor type 2
Name:C-X-C chemokine receptor type 2
Type:Protein
Mol. Mass.:40767.88
Organism:Homo sapiens (Human)
Description:P25025
Residue:360
BDBM50248545
NameBDBM50248545
Synonyms:(S)-3-(2-(1-(benzo[d][1,3]dioxol-5-yl)-2,2,2-trifluoroethylamino)-3,4-dioxocyclobut-1-enylamino)-2-hydroxy-N,N-dimethylbenzamide | CHEMBL518857
TypeSmall organic molecule
Emp. Form.C22H18F3N3O6
Mol. Mass.477.39
SMILESCN(C)C(=O)c1cccc(Nc2c(N[C@@H](c3ccc4OCOc4c3)C(F)(F)F)c(=O)c2=O)c1O