Reaction Details
TargetC-X-C chemokine receptor type 1
LigandBDBM50248038
Substrate/Competitorn/a
Meas. Tech.ChEMBL_566229 (CHEMBL963310)
IC50 143±n/a nM
Citation Biju, PTaveras, AGYu, YZheng, JHipkin, RWFossetta, JFan, XFine, JLundell, D 3,4-Diamino-1,2,5-thiadiazole as potent and selective CXCR2 antagonists. Bioorg Med Chem Lett19:1434-7 (2009) 
 
C-X-C chemokine receptor type 1
Name:C-X-C chemokine receptor type 1
Type:Enzyme
Mol. Mass.:39803.83
Organism:Homo sapiens (Human)
Description:P25024
Residue:350
BDBM50248038
NameBDBM50248038
Synonyms:(R)-3-(4-(2,2-dimethyl-1-(5-methylfuran-2-yl)propylamino)-1,2,5-thiadiazol-3-ylamino)-2-hydroxy-N,N-dimethylbenzamide | CHEMBL455431
TypeSmall organic molecule
Emp. Form.C21H27N5O3S
Mol. Mass.429.536
SMILESCN(C)C(=O)c1cccc(Nc2nsnc2N[C@@H](c2ccc(C)o2)C(C)(C)C)c1O