Reaction Details
TargetC-X-C chemokine receptor type 1
LigandBDBM50248036
Substrate/Competitorn/a
Meas. Tech.ChEMBL_566227 (CHEMBL963308)
Ki 53±n/a nM
Citation Biju, PTaveras, AGYu, YZheng, JHipkin, RWFossetta, JFan, XFine, JLundell, D 3,4-Diamino-1,2,5-thiadiazole as potent and selective CXCR2 antagonists. Bioorg Med Chem Lett19:1434-7 (2009) 
 
C-X-C chemokine receptor type 1
Name:C-X-C chemokine receptor type 1
Type:Enzyme
Mol. Mass.:39803.83
Organism:Homo sapiens (Human)
Description:P25024
Residue:350
BDBM50248036
NameBDBM50248036
Synonyms:(S)-2-hydroxy-N,N-dimethyl-3-(4-(2,2,2-trifluoro-1-(5-methylfuran-2-yl)ethylamino)-1,2,5-thiadiazol-3-ylamino)benzamide | CHEMBL455430
TypeSmall organic molecule
Emp. Form.C18H18F3N5O3S
Mol. Mass.441.427
SMILESCN(C)C(=O)c1cccc(Nc2nsnc2N[C@@H](c2ccc(C)o2)C(F)(F)F)c1O