Reaction Details
TargetC-X-C chemokine receptor type 1
LigandBDBM50248083
Substrate/Competitorn/a
Meas. Tech.ChEMBL_566227 (CHEMBL963308)
Ki 18±n/a nM
Citation Biju, PTaveras, AGYu, YZheng, JHipkin, RWFossetta, JFan, XFine, JLundell, D 3,4-Diamino-1,2,5-thiadiazole as potent and selective CXCR2 antagonists. Bioorg Med Chem Lett19:1434-7 (2009) 
 
C-X-C chemokine receptor type 1
Name:C-X-C chemokine receptor type 1
Type:Enzyme
Mol. Mass.:39803.83
Organism:Homo sapiens (Human)
Description:P25024
Residue:350
BDBM50248083
NameBDBM50248083
Synonyms:(R)-(3-(4-(2,2-dimethyl-1-(5-methylfuran-2-yl)propylamino)-1,2,5-thiadiazol-3-ylamino)-2-hydroxyphenyl)(morpholino)methanone | CHEMBL518696
TypeSmall organic molecule
Emp. Form.C23H29N5O4S
Mol. Mass.471.572
SMILESCc1ccc(o1)[C@H](Nc1nsnc1Nc1cccc(C(=O)N2CCOCC2)c1O)C(C)(C)C