Reaction Details
TargetC-X-C chemokine receptor type 2
LigandBDBM50248592
Substrate/Competitorn/a
Meas. Tech.ChEMBL_566228 (CHEMBL963309)
Ki 10000±n/a nM
Citation Biju, PTaveras, AGYu, YZheng, JHipkin, RWFossetta, JFan, XFine, JLundell, D 3,4-Diamino-1,2,5-thiadiazole as potent and selective CXCR2 antagonists. Bioorg Med Chem Lett19:1434-7 (2009) 
 
C-X-C chemokine receptor type 2
Name:C-X-C chemokine receptor type 2
Type:Protein
Mol. Mass.:40767.88
Organism:Homo sapiens (Human)
Description:P25025
Residue:360
BDBM50248592
NameBDBM50248592
Synonyms:(R)-3-(4-(1-(2,3-dihydro-1H-inden-5-yl)-2,2-dimethylpropylamino)-1,2,5-thiadiazol-3-ylamino)-2-hydroxy-N,N-dimethylbenzamide | CHEMBL518355
TypeSmall organic molecule
Emp. Form.C25H31N5O2S
Mol. Mass.465.611
SMILESCN(C)C(=O)c1cccc(Nc2nsnc2N[C@@H](c2ccc3CCCc3c2)C(C)(C)C)c1O