Reaction Details
TargetC-X-C chemokine receptor type 2
LigandBDBM50247950
Substrate/Competitorn/a
Meas. Tech.ChEMBL_566228 (CHEMBL963309)
Ki 3000±n/a nM
Citation Biju, PTaveras, AGYu, YZheng, JHipkin, RWFossetta, JFan, XFine, JLundell, D 3,4-Diamino-1,2,5-thiadiazole as potent and selective CXCR2 antagonists. Bioorg Med Chem Lett19:1434-7 (2009) 
 
C-X-C chemokine receptor type 2
Name:C-X-C chemokine receptor type 2
Type:Protein
Mol. Mass.:40767.88
Organism:Homo sapiens (Human)
Description:P25025
Residue:360
BDBM50247950
NameBDBM50247950
Synonyms:(R)-2-hydroxy-N,N-dimethyl-3-(4-(1-(5-methylfuran-2-yl)propylamino)-1,2,5-thiadiazol-3-ylamino)benzamide | CHEMBL518201
TypeSmall organic molecule
Emp. Form.C19H23N5O3S
Mol. Mass.401.483
SMILESCC[C@@H](Nc1nsnc1Nc1cccc(C(=O)N(C)C)c1O)c1ccc(C)o1