Reaction Details
TargetC-X-C chemokine receptor type 2
LigandBDBM50248112
Substrate/Competitorn/a
Meas. Tech.ChEMBL_566228 (CHEMBL963309)
Ki 168±n/a nM
Citation Biju, PTaveras, AGYu, YZheng, JHipkin, RWFossetta, JFan, XFine, JLundell, D 3,4-Diamino-1,2,5-thiadiazole as potent and selective CXCR2 antagonists. Bioorg Med Chem Lett19:1434-7 (2009) 
 
C-X-C chemokine receptor type 2
Name:C-X-C chemokine receptor type 2
Type:Protein
Mol. Mass.:40767.88
Organism:Homo sapiens (Human)
Description:P25025
Residue:360
BDBM50248112
NameBDBM50248112
Synonyms:(R)-3-(4-(2,2-dimethyl-1-(5-methylfuran-2-yl)propylamino)-1,2,5-thiadiazol-3-ylamino)-2-hydroxy-N,N-dimethyl-6-(trifluoromethyl)benzamide | CHEMBL518802
TypeSmall organic molecule
Emp. Form.C22H26F3N5O3S
Mol. Mass.497.534
SMILESCN(C)C(=O)c1c(O)c(Nc2nsnc2N[C@@H](c2ccc(C)o2)C(C)(C)C)ccc1C(F)(F)F