Reaction Details
TargetNeuronal acetylcholine receptor subunit alpha-7
LigandBDBM50413332
Substrate/Competitorn/a
Meas. Tech.ChEMBL_566261 (CHEMBL953564)
EC50 7.94±n/a nM
Citation Enz, AFeuerbach, DFrederiksen, MUGentsch, CHurth, KMüller, WNozulak, JRoy, BL Gamma-lactams--a novel scaffold for highly potent and selective alpha 7 nicotinic acetylcholine receptor agonists. Bioorg Med Chem Lett19:1287-91 (2009) 
 
Neuronal acetylcholine receptor subunit alpha-7
Name:Neuronal acetylcholine receptor subunit alpha-7
Type:n/a
Mol. Mass.:56448.33
Organism:Homo sapiens (Human)
Description: CHRNA7 (NACHRA7)
Residue:502
BDBM50413332
NameBDBM50413332
Synonyms:CHEMBL503427
TypeSmall organic molecule
Emp. Form.C21H26N2O2
Mol. Mass.338.4433
SMILESCN1C(CC(CN2CCCCC2)C1=O)C#Cc1ccc2OCCc2c1