Reaction Details
TargetAurora kinase B
LigandBDBM50248185
Substrate/Competitorn/a
Meas. Tech.ChEMBL_566617 (CHEMBL960143)
IC50 720±n/a nM
Citation Tasler, SMüller, OWieber, THerz, TKrauss, RTotzke, FKubbutat, MHSchächtele, C N-substituted 2'-(aminoaryl)benzothiazoles as kinase inhibitors: hit identification and scaffold hopping. Bioorg Med Chem Lett19:1349-56 (2009) 
 
Aurora kinase B
Name:Aurora kinase B
Type:Protein
Mol. Mass.:39327.72
Organism:Homo sapiens (Human)
Description:Q96GD4
Residue:344
BDBM50248185
NameBDBM50248185
Synonyms:CHEMBL472946 | N-(4-(benzo[d]thiazol-2-yl)phenyl)thieno[3,2-d]pyrimidin-4-amine
TypeSmall organic molecule
Emp. Form.C19H12N4S2
Mol. Mass.360.455
SMILESN(c1ccc(cc1)-c1nc2ccccc2s1)c1ncnc2ccsc12