Reaction Details
TargetVascular endothelial growth factor receptor 3
LigandBDBM50248085
Substrate/Competitorn/a
Meas. Tech.ChEMBL_566610 (CHEMBL964949)
IC50 1000±n/a nM
Citation Tasler, SMüller, OWieber, THerz, TKrauss, RTotzke, FKubbutat, MHSchächtele, C N-substituted 2'-(aminoaryl)benzothiazoles as kinase inhibitors: hit identification and scaffold hopping. Bioorg Med Chem Lett19:1349-56 (2009) 
 
Vascular endothelial growth factor receptor 3
Name:Vascular endothelial growth factor receptor 3
Type:Protein
Mol. Mass.:152749.58
Organism:Homo sapiens (Human)
Description:P35916-2
Residue:1363
BDBM50248085
NameBDBM50248085
Synonyms:CHEMBL460746 | N-(3-(benzo[d]thiazol-2-yl)-4-hydroxyphenylcarbamothioyl)-4-nitrobenzamide
TypeSmall organic molecule
Emp. Form.C21H14N4O4S2
Mol. Mass.450.49
SMILESOc1ccc(NC(=S)NC(=O)c2ccc(cc2)[N+]([O-])=O)cc1-c1nc2ccccc2s1