Reaction Details
TargetAurora kinase B
LigandBDBM50248230
Substrate/Competitorn/a
Meas. Tech.ChEMBL_566617 (CHEMBL960143)
IC50 750±n/a nM
Citation Tasler, SMüller, OWieber, THerz, TKrauss, RTotzke, FKubbutat, MHSchächtele, C N-substituted 2'-(aminoaryl)benzothiazoles as kinase inhibitors: hit identification and scaffold hopping. Bioorg Med Chem Lett19:1349-56 (2009) 
 
Aurora kinase B
Name:Aurora kinase B
Type:Protein
Mol. Mass.:39327.72
Organism:Homo sapiens (Human)
Description:Q96GD4
Residue:344
BDBM50248230
NameBDBM50248230
Synonyms:CHEMBL474543 | N-(4-(benzo[d]thiazol-2-yl)phenyl)-7-chloroquinolin-4-amine
TypeSmall organic molecule
Emp. Form.C22H14ClN3S
Mol. Mass.387.885
SMILESClc1ccc2c(Nc3ccc(cc3)-c3nc4ccccc4s3)ccnc2c1