Reaction Details
TargetVascular endothelial growth factor receptor 2
LigandBDBM50248291
Substrate/Competitorn/a
Meas. Tech.ChEMBL_566609 (CHEMBL964948)
IC50 800±n/a nM
Citation Tasler, SMüller, OWieber, THerz, TKrauss, RTotzke, FKubbutat, MHSchächtele, C N-substituted 2'-(aminoaryl)benzothiazoles as kinase inhibitors: hit identification and scaffold hopping. Bioorg Med Chem Lett19:1349-56 (2009) 
 
Vascular endothelial growth factor receptor 2
Name:Vascular endothelial growth factor receptor 2
Type:Receptor Tyrosine Kinase
Mol. Mass.:151510.97
Organism:Homo sapiens (Human)
Description:P35968
Residue:1356
BDBM50248291
NameBDBM50248291
Synonyms:CHEMBL473557 | N-(4-(benzo[d]thiazol-2-yl)-2-fluorophenyl)-7-chloroquinazolin-4-amine
TypeSmall organic molecule
Emp. Form.C21H12ClFN4S
Mol. Mass.406.863
SMILESFc1cc(ccc1Nc1ncnc2cc(Cl)ccc12)-c1nc2ccccc2s1