Reaction Details
TargetEpidermal growth factor receptor
LigandBDBM50248149
Substrate/Competitorn/a
Meas. Tech.ChEMBL_566606 (CHEMBL964945)
IC50 720±n/a nM
Citation Tasler, SMüller, OWieber, THerz, TKrauss, RTotzke, FKubbutat, MHSchächtele, C N-substituted 2'-(aminoaryl)benzothiazoles as kinase inhibitors: hit identification and scaffold hopping. Bioorg Med Chem Lett19:1349-56 (2009) 
 
Epidermal growth factor receptor
Name:Epidermal growth factor receptor
Type:Receptor Kinase Domain
Mol. Mass.:134279.59
Organism:Homo sapiens (Human)
Description:P00533
Residue:1210
BDBM50248149
NameBDBM50248149
Synonyms:CHEMBL462162 | N-(4-(benzo[d]thiazol-2-yl)-3-methoxyphenyl)-7H-pyrrolo[2,3-d]pyrimidin-4-amine
TypeSmall organic molecule
Emp. Form.C20H15N5OS
Mol. Mass.373.431
SMILESCOc1cc(Nc2ncnc3[nH]ccc23)ccc1-c1nc2ccccc2s1