Reaction Details
TargetAurora kinase A
LigandBDBM50248293
Substrate/Competitorn/a
Meas. Tech.ChEMBL_566616 (CHEMBL960142)
IC50 350±n/a nM
Citation Tasler, SMüller, OWieber, THerz, TKrauss, RTotzke, FKubbutat, MHSchächtele, C N-substituted 2'-(aminoaryl)benzothiazoles as kinase inhibitors: hit identification and scaffold hopping. Bioorg Med Chem Lett19:1349-56 (2009) 
 
Aurora kinase A
Name:Aurora kinase A
Type:Serine/threonine-protein kinase
Mol. Mass.:45830.98
Organism:Homo sapiens (Human)
Description:O14965
Residue:403
BDBM50248293
NameBDBM50248293
Synonyms:CHEMBL473556 | N-(4-(benzo[d]thiazol-2-yl)phenyl)-6,7-dimethoxyquinazolin-4-amine
TypeSmall organic molecule
Emp. Form.C23H18N4O2S
Mol. Mass.414.48
SMILESCOc1cc2ncnc(Nc3ccc(cc3)-c3nc4ccccc4s3)c2cc1OC