Reaction Details
TargetEpidermal growth factor receptor
LigandBDBM50248085
Substrate/Competitorn/a
Meas. Tech.ChEMBL_566606 (CHEMBL964945)
IC50 280±n/a nM
Citation Tasler, SMüller, OWieber, THerz, TKrauss, RTotzke, FKubbutat, MHSchächtele, C N-substituted 2'-(aminoaryl)benzothiazoles as kinase inhibitors: hit identification and scaffold hopping. Bioorg Med Chem Lett19:1349-56 (2009) 
 
Epidermal growth factor receptor
Name:Epidermal growth factor receptor
Type:Receptor Kinase Domain
Mol. Mass.:134279.59
Organism:Homo sapiens (Human)
Description:P00533
Residue:1210
BDBM50248085
NameBDBM50248085
Synonyms:CHEMBL460746 | N-(3-(benzo[d]thiazol-2-yl)-4-hydroxyphenylcarbamothioyl)-4-nitrobenzamide
TypeSmall organic molecule
Emp. Form.C21H14N4O4S2
Mol. Mass.450.49
SMILESOc1ccc(NC(=S)NC(=O)c2ccc(cc2)[N+]([O-])=O)cc1-c1nc2ccccc2s1