Reaction Details
TargetProto-oncogene tyrosine-protein kinase Src
LigandBDBM50248413
Substrate/Competitorn/a
Meas. Tech.ChEMBL_566614 (CHEMBL960140)
IC50 190±n/a nM
Citation Tasler, SMüller, OWieber, THerz, TKrauss, RTotzke, FKubbutat, MHSchächtele, C N-substituted 2'-(aminoaryl)benzothiazoles as kinase inhibitors: hit identification and scaffold hopping. Bioorg Med Chem Lett19:1349-56 (2009) 
 
Proto-oncogene tyrosine-protein kinase Src
Name:Proto-oncogene tyrosine-protein kinase Src
Type:Protein
Mol. Mass.:59838.60
Organism:Homo sapiens (Human)
Description:P12931
Residue:536
BDBM50248413
NameBDBM50248413
Synonyms:CHEMBL491686 | N2-(3-(benzo[d]thiazol-2-yl)phenyl)-N4-(5-methyl-1H-pyrazol-3-yl)pyrimidine-2,4-diamine
TypeSmall organic molecule
Emp. Form.C21H17N7S
Mol. Mass.399.472
SMILESCc1cc(Nc2ccnc(Nc3cccc(c3)-c3nc4ccccc4s3)n2)[nH]n1