Reaction Details
TargetVascular endothelial growth factor receptor 2
LigandBDBM50248054
Substrate/Competitorn/a
Meas. Tech.ChEMBL_566632 (CHEMBL960946)
IC50 3±n/a nM
Citation Raeppel, SClaridge, SSaavedra, OGaudette, FZhan, LMannion, MZhou, NRaeppel, FGranger, MCIsakovic, LDéziel, RNguyen, HBeaulieu, NBeaulieu, CDupont, IRobert, MFLefebvre, SDubay, MRahil, JWang, JSte-Croix, HRobert Macleod, ABesterman, JVaisburg, A N-(3-fluoro-4-(2-arylthieno[3,2-b]pyridin-7-yloxy)phenyl)-2-oxo-3-phenylimidazolidine-1-carboxamides: a novel series of dual c-Met/VEGFR2 receptor tyrosine kinase inhibitors. Bioorg Med Chem Lett19:1323-8 (2009) 
 
Vascular endothelial growth factor receptor 2
Name:Vascular endothelial growth factor receptor 2
Type:Receptor Tyrosine Kinase
Mol. Mass.:151510.97
Organism:Homo sapiens (Human)
Description:P35968
Residue:1356
BDBM50248054
NameBDBM50248054
Synonyms:CHEMBL508395 | N-(3-fluoro-4-(2-(4-((methyl(2-(4-methylpiperazin-1-yl)ethyl)amino)methyl)phenyl)thieno[3,2-b]pyridin-7-yloxy)phenyl)-2-oxo-3-phenylimidazolidine-1-carboxamide
TypeSmall organic molecule
Emp. Form.C38H40FN7O3S
Mol. Mass.693.833
SMILESCN(CCN1CCN(C)CC1)Cc1ccc(cc1)-c1cc2nccc(Oc3ccc(NC(=O)N4CCN(C4=O)c4ccccc4)cc3F)c2s1