Reaction Details
TargetFatty acid-binding protein, heart
LigandBDBM50247995
Substrate/Competitorn/a
Meas. Tech.ChEMBL_566943 (CHEMBL964126)
IC50>10000±n/a nM
Citation Barf, TLehmann, FHammer, KHaile, SAxen, EMedina, CUppenberg, JSvensson, SRondahl, LLundbäck, T N-Benzyl-indolo carboxylic acids: Design and synthesis of potent and selective adipocyte fatty-acid binding protein (A-FABP) inhibitors. Bioorg Med Chem Lett19:1745-8 (2009) 
 
Fatty acid-binding protein, heart
Name:Fatty acid-binding protein, heart
Type:PROTEIN
Mol. Mass.:14858.36
Organism:Homo sapiens (Human)
Description:ChEMBL_1463784
Residue:133
BDBM50247995
NameBDBM50247995
Synonyms:5-(4-fluorobenzyl)-5,6,7,8,9,10-hexahydrocyclohepta[b]indole-4-carboxylic acid | CHEMBL518181
TypeSmall organic molecule
Emp. Form.C21H20FNO2
Mol. Mass.337.3874
SMILESOC(=O)c1cccc2c3CCCCCc3n(Cc3ccc(F)cc3)c12