Reaction Details
TargetFatty acid-binding protein, heart
LigandBDBM50248242
Substrate/Competitorn/a
Meas. Tech.ChEMBL_566943 (CHEMBL964126)
IC50>10000±n/a nM
Citation Barf, TLehmann, FHammer, KHaile, SAxen, EMedina, CUppenberg, JSvensson, SRondahl, LLundbäck, T N-Benzyl-indolo carboxylic acids: Design and synthesis of potent and selective adipocyte fatty-acid binding protein (A-FABP) inhibitors. Bioorg Med Chem Lett19:1745-8 (2009) 
 
Fatty acid-binding protein, heart
Name:Fatty acid-binding protein, heart
Type:PROTEIN
Mol. Mass.:14858.36
Organism:Homo sapiens (Human)
Description:ChEMBL_1463784
Residue:133
BDBM50248242
NameBDBM50248242
Synonyms:5-(3-(trifluoromethyl)benzyl)-5,6,7,8,9,10-hexahydrocyclohepta[b]indole-4-carboxylic acid | CHEMBL474943
TypeSmall organic molecule
Emp. Form.C22H20F3NO2
Mol. Mass.387.3949
SMILESOC(=O)c1cccc2c3CCCCCc3n(Cc3cccc(c3)C(F)(F)F)c12