Reaction Details
TargetLow molecular weight phosphotyrosine protein phosphatase
LigandBDBM50267069
Substrate/Competitorn/a
Meas. Tech.ChEMBL_563762 (CHEMBL993525)
IC50 3100±n/a nM
Citation Ottanà, RMaccari, RCiurleo, RPaoli, PJacomelli, MManao, GCamici, GLaggner, CLanger, T 5-Arylidene-2-phenylimino-4-thiazolidinones as PTP1B and LMW-PTP inhibitors. Bioorg Med Chem17:1928-37 (2009) 
 
Low molecular weight phosphotyrosine protein phosphatase
Name:Low molecular weight phosphotyrosine protein phosphatase
Type:n/a
Mol. Mass.:18042.81
Organism:Homo sapiens (Human)
Description:P24666
Residue:158
BDBM50267069
NameBDBM50267069
Synonyms:4-{[4-Oxo-5-(4-phenoxybenzylidene)-2-phenyliminothiazolidin-3-yl]methyl}benzoic acid | CHEMBL478274
TypeSmall organic molecule
Emp. Form.C30H22N2O4S
Mol. Mass.506.572
SMILESOC(=O)c1ccc(CN2\C(S\C(=C/c3ccc(Oc4ccccc4)cc3)C2=O)=N\c2ccccc2)cc1