Reaction Details
TargetLow molecular weight phosphotyrosine protein phosphatase
LigandBDBM50267070
Substrate/Competitorn/a
Meas. Tech.ChEMBL_563762 (CHEMBL993525)
IC50 3100±n/a nM
Citation Ottanà, RMaccari, RCiurleo, RPaoli, PJacomelli, MManao, GCamici, GLaggner, CLanger, T 5-Arylidene-2-phenylimino-4-thiazolidinones as PTP1B and LMW-PTP inhibitors. Bioorg Med Chem17:1928-37 (2009) 
 
Low molecular weight phosphotyrosine protein phosphatase
Name:Low molecular weight phosphotyrosine protein phosphatase
Type:n/a
Mol. Mass.:18042.81
Organism:Homo sapiens (Human)
Description:P24666
Residue:158
BDBM50267070
NameBDBM50267070
Synonyms:4-{[5-(3-Benzyloxybenzylidene)-4-oxo-2-phenyliminothiazolidin-3-yl]methyl}benzoic acid | CHEMBL514239
TypeSmall organic molecule
Emp. Form.C31H24N2O4S
Mol. Mass.520.598
SMILESOC(=O)c1ccc(CN2\C(S\C(=C/c3cccc(OCc4ccccc4)c3)C2=O)=N\c2ccccc2)cc1