Reaction Details
TargetCannabinoid receptor 2
LigandBDBM50133546
Substrate/Competitorn/a
Meas. Tech.ChEMBL_562316 (CHEMBL1015290)
Ki 0.91±n/a nM
Citation Bhattacharjee, HGurley, SNMoore, BM Design and synthesis of novel tri-aryl CB2 selective cannabinoid ligands. Bioorg Med Chem Lett19:1691-3 (2009) 
 
Cannabinoid receptor 2
Name:Cannabinoid receptor 2
Type:G Protein-Coupled Receptor (GPCR)
Mol. Mass.:39690.94
Organism:Homo sapiens (Human)
Description:P34972
Residue:360
BDBM50133546
NameBDBM50133546
Synonyms:(6aR,10aR)-6,6,9-Trimethyl-3-(1-methyl-1-phenyl-ethyl)-6a,7,10,10a-tetrahydro-6H-benzo[c]chromen-1-ol 6,6,9-trimethyl-3-(2-phenylpropan-2-yl)-6a,7,10,10a-tetrahydro-6H-benzo[c]chromen-1-ol KM-233
TypeSmall organic molecule
Emp. Form.C25H30O2
Mol. Mass.362.5045
SMILESCC1=CC[C@@H]2[C@@H](C1)c1c(O)cc(cc1OC2(C)C)C(C)(C)c1ccccc1