Reaction Details
TargetCannabinoid receptor 1
LigandBDBM50067734
Substrate/Competitorn/a
Meas. Tech.ChEMBL_562315 (CHEMBL1015289)
Ki 28.5±n/a nM
Citation Bhattacharjee, HGurley, SNMoore, BM Design and synthesis of novel tri-aryl CB2 selective cannabinoid ligands. Bioorg Med Chem Lett19:1691-3 (2009) 
 
Cannabinoid receptor 1
Name:Cannabinoid receptor 1
Type:G Protein-Coupled Receptor (GPCR)
Mol. Mass.:52868.96
Organism:Homo sapiens (Human)
Description:P21554
Residue:472
BDBM50067734
NameBDBM50067734
Synonyms:(-)-(6aR-trans)-6,6,9-trimethyl-3-pentyl-6a,7,10,10a-tetrahydro-6H-benzo[c]chromen-1-ol (6aR,10aR)-6,6,9-Trimethyl-3-pentyl-6a,7,10,10a-tetrahydro-6H-benzo[c]chromen-1-ol CHEMBL267227 | delta 8-tetrahydrocannobinol
TypeSmall organic molecule
Emp. Form.C21H30O2
Mol. Mass.314.4617
SMILESCCCCCc1cc(O)c2[C@@H]3CC(C)=CC[C@H]3C(C)(C)Oc2c1