Reaction Details
TargetNitric oxide synthase, inducible
LigandBDBM50266728
Substrate/Competitorn/a
Meas. Tech.ChEMBL_563975 (CHEMBL955235)
Kd 116000±n/a nM
Citation Martin, NIWoodward, JJWinter, MBMarletta, MA 4,4-Difluorinated analogues of l-arginine and N(G)-hydroxy-l-arginine as mechanistic probes for nitric oxide synthase. Bioorg Med Chem Lett19:1758-62 (2009) 
 
Nitric oxide synthase, inducible
Name:Nitric oxide synthase, inducible
Type:Homodimer
Mol. Mass.:131141.95
Organism:Homo sapiens (Human)
Description:P35228
Residue:1153
BDBM50266728
NameBDBM50266728
Synonyms:4,4-difluoro-N(gamma)-hydroxy-L-arginine | CHEMBL476417
TypeSmall organic molecule
Emp. Form.C6H12F2N4O3
Mol. Mass.226.1813
SMILESNC(NO)=NCC(F)(F)C[C@H]([NH3+])C([O-])=O