Reaction Details
TargetP2X purinoceptor 1
LigandBDBM50257829
Substrate/Competitorn/a
Meas. Tech.ChEMBL_562363 (CHEMBL1017977)
IC50>10000±n/a nM
Citation Jahangir, AAlam, MCarter, DSDillon, MPBois, DJFord, APGever, JRLin, CWagner, PJZhai, YZira, J Identification and SAR of novel diaminopyrimidines. Part 2: The discovery of RO-51, a potent and selective, dual P2X(3)/P2X(2/3) antagonist for the treatment of pain. Bioorg Med Chem Lett19:1632-5 (2009) 
 
P2X purinoceptor 1
Name:P2X purinoceptor 1
Type:Enzyme Catalytic Domain
Mol. Mass.:44992.65
Organism:Homo sapiens (Human)
Description:Purinergic, P2X 0 HUMAN::P51575
Residue:399
BDBM50257829
NameBDBM50257829
Synonyms:2-(4-amino-5-(5-iodo-2-isopropyl-4-methoxyphenoxy)pyrimidin-2-ylamino)propane-1,3-diol Ro-51
TypeSmall organic molecule
Emp. Form.C17H23IN4O4
Mol. Mass.474.2934
SMILESCOc1cc(C(C)C)c(Oc2cnc(NC(CO)CO)nc2N)cc1I