Reaction Details
TargetP2X purinoceptor 3
LigandBDBM50413366
Substrate/Competitorn/a
Meas. Tech.ChEMBL_562361 (CHEMBL1017975)
IC50 16±n/a nM
Citation Jahangir, AAlam, MCarter, DSDillon, MPBois, DJFord, APGever, JRLin, CWagner, PJZhai, YZira, J Identification and SAR of novel diaminopyrimidines. Part 2: The discovery of RO-51, a potent and selective, dual P2X(3)/P2X(2/3) antagonist for the treatment of pain. Bioorg Med Chem Lett19:1632-5 (2009) 
 
P2X purinoceptor 3
Name:P2X purinoceptor 3
Type:Enzyme Catalytic Domain
Mol. Mass.:44397.63
Organism:RAT
Description:Purinergic, P2X3 0 RAT::P49654
Residue:397
BDBM50413366
NameBDBM50413366
Synonyms:CHEMBL492907
TypeSmall organic molecule
Emp. Form.C17H23IN4O3
Mol. Mass.458.294
SMILESCOc1cc(C(C)C)c(Oc2cnc(NCCCO)nc2N)cc1I