Reaction Details
TargetP2X purinoceptor 5
LigandBDBM50257636
Substrate/Competitorn/a
Meas. Tech.ChEMBL_565946 (CHEMBL960841)
IC50>10000±n/a nM
Citation Carter, DSAlam, MCai, HDillon, MPFord, APGever, JRJahangir, ALin, CMoore, AGWagner, PJZhai, Y Identification and SAR of novel diaminopyrimidines. Part 1: The discovery of RO-4, a dual P2X(3)/P2X(2/3) antagonist for the treatment of pain. Bioorg Med Chem Lett19:1628-31 (2009) 
 
P2X purinoceptor 5
Name:P2X purinoceptor 5
Type:PROTEIN
Mol. Mass.:47208.74
Organism:Homo sapiens (Human)
Description:ChEMBL_612725
Residue:422
BDBM50257636
NameBDBM50257636
Synonyms:5-(5-iodo-2-isopropyl-4-methoxyphenoxy)pyrimidine-2,4-diamine | CHEMBL526307
TypeSmall organic molecule
Emp. Form.C14H17IN4O2
Mol. Mass.400.2149
SMILESCOc1cc(C(C)C)c(Oc2cnc(N)nc2N)cc1I