Reaction Details
TargetP2X purinoceptor 3
LigandBDBM50413379
Substrate/Competitorn/a
Meas. Tech.ChEMBL_565941 (CHEMBL960836)
IC50 1585±n/a nM
Citation Carter, DSAlam, MCai, HDillon, MPFord, APGever, JRJahangir, ALin, CMoore, AGWagner, PJZhai, Y Identification and SAR of novel diaminopyrimidines. Part 1: The discovery of RO-4, a dual P2X(3)/P2X(2/3) antagonist for the treatment of pain. Bioorg Med Chem Lett19:1628-31 (2009) 
 
P2X purinoceptor 3
Name:P2X purinoceptor 3
Type:Enzyme Catalytic Domain
Mol. Mass.:44397.63
Organism:RAT
Description:Purinergic, P2X3 0 RAT::P49654
Residue:397
BDBM50413379
NameBDBM50413379
Synonyms:CHEMBL504607 | TCMDC-132471
TypeSmall organic molecule
Emp. Form.C14H18N4O2
Mol. Mass.274.3183
SMILESCOc1ccc(Oc2cnc(N)nc2N)c(c1)C(C)C