Reaction Details
TargetP2X purinoceptor 3
LigandBDBM50413381
Substrate/Competitorn/a
Meas. Tech.ChEMBL_565941 (CHEMBL960836)
IC50 3981±n/a nM
Citation Carter, DSAlam, MCai, HDillon, MPFord, APGever, JRJahangir, ALin, CMoore, AGWagner, PJZhai, Y Identification and SAR of novel diaminopyrimidines. Part 1: The discovery of RO-4, a dual P2X(3)/P2X(2/3) antagonist for the treatment of pain. Bioorg Med Chem Lett19:1628-31 (2009) 
 
P2X purinoceptor 3
Name:P2X purinoceptor 3
Type:Enzyme Catalytic Domain
Mol. Mass.:44397.63
Organism:RAT
Description:Purinergic, P2X3 0 RAT::P49654
Residue:397
BDBM50413381
NameBDBM50413381
Synonyms:CHEMBL494834
TypeSmall organic molecule
Emp. Form.C13H16N4O
Mol. Mass.244.2923
SMILESCC(C)c1ccccc1Oc1cnc(N)nc1N