Reaction Details
TargetP2X purinoceptor 3
LigandBDBM50257636
Substrate/Competitorn/a
Meas. Tech.ChEMBL_565941 (CHEMBL960836)
IC50 10±n/a nM
Citation Carter, DSAlam, MCai, HDillon, MPFord, APGever, JRJahangir, ALin, CMoore, AGWagner, PJZhai, Y Identification and SAR of novel diaminopyrimidines. Part 1: The discovery of RO-4, a dual P2X(3)/P2X(2/3) antagonist for the treatment of pain. Bioorg Med Chem Lett19:1628-31 (2009) 
 
P2X purinoceptor 3
Name:P2X purinoceptor 3
Type:Enzyme Catalytic Domain
Mol. Mass.:44397.63
Organism:RAT
Description:Purinergic, P2X3 0 RAT::P49654
Residue:397
BDBM50257636
NameBDBM50257636
Synonyms:5-(5-iodo-2-isopropyl-4-methoxyphenoxy)pyrimidine-2,4-diamine | CHEMBL526307
TypeSmall organic molecule
Emp. Form.C14H17IN4O2
Mol. Mass.400.2149
SMILESCOc1cc(C(C)C)c(Oc2cnc(N)nc2N)cc1I