Reaction Details
TargetP2X purinoceptor 2
LigandBDBM50413377
Substrate/Competitorn/a
Meas. Tech.ChEMBL_565944 (CHEMBL960839)
IC50 398±n/a nM
Citation Carter, DSAlam, MCai, HDillon, MPFord, APGever, JRJahangir, ALin, CMoore, AGWagner, PJZhai, Y Identification and SAR of novel diaminopyrimidines. Part 1: The discovery of RO-4, a dual P2X(3)/P2X(2/3) antagonist for the treatment of pain. Bioorg Med Chem Lett19:1628-31 (2009) 
 
P2X purinoceptor 2
Name:P2X purinoceptor 2
Type:Enzyme Catalytic Domain
Mol. Mass.:51765.18
Organism:Homo sapiens (Human)
Description:PurinergicP2X2/3 0 HUMAN::Q9UBL9
Residue:471
BDBM50413377
NameBDBM50413377
Synonyms:CHEMBL494176
TypeSmall organic molecule
Emp. Form.C14H17IN4O2
Mol. Mass.400.2149
SMILESCOc1cc(Oc2cnc(N)nc2N)c(cc1I)C(C)C