Reaction Details
TargetHistamine H2 receptor
LigandBDBM50257636
Substrate/Competitorn/a
Meas. Tech.ChEMBL_565949 (CHEMBL960845)
Ki 100000000±n/a nM
Citation Carter, DSAlam, MCai, HDillon, MPFord, APGever, JRJahangir, ALin, CMoore, AGWagner, PJZhai, Y Identification and SAR of novel diaminopyrimidines. Part 1: The discovery of RO-4, a dual P2X(3)/P2X(2/3) antagonist for the treatment of pain. Bioorg Med Chem Lett19:1628-31 (2009) 
 
Histamine H2 receptor
Name:Histamine H2 receptor
Type:G Protein-Coupled Receptor (GPCR)
Mol. Mass.:40115.31
Organism:Homo sapiens (Human)
Description:n/a
Residue:359
BDBM50257636
NameBDBM50257636
Synonyms:5-(5-iodo-2-isopropyl-4-methoxyphenoxy)pyrimidine-2,4-diamine | CHEMBL526307
TypeSmall organic molecule
Emp. Form.C14H17IN4O2
Mol. Mass.400.2149
SMILESCOc1cc(C(C)C)c(Oc2cnc(N)nc2N)cc1I