Reaction Details
TargetPotassium voltage-gated channel subfamily H member 2
LigandBDBM50257832
Substrate/Competitorn/a
Meas. Tech.ChEMBL_565970 (CHEMBL963244)
Ki 903±n/a nM
Citation Owen, DRRodriguez-Lens, MCorless, MDGaulier, SMHorne, VAKinloch, RAMaw, GNPearce, DWRees, HRinger, TJRyckmans, TStammen, BL 2,4-Diaminopyridine delta-opioid receptor agonists and their associated hERG pharmacology. Bioorg Med Chem Lett19:1702-6 (2009) 
 
Potassium voltage-gated channel subfamily H member 2
Name:Potassium voltage-gated channel subfamily H member 2
Type:Multi-pass membrane protein
Mol. Mass.:126672.65
Organism:Homo sapiens (Human)
Description:Q12809
Residue:1159
BDBM50257832
NameBDBM50257832
Synonyms:3-(1-(4-aminopyridin-2-yl)piperidin-4-yl)-1-phenyl-1H-imidazo[4,5-b]pyridin-2(3H)-one | CHEMBL522854
TypeSmall organic molecule
Emp. Form.C22H22N6O
Mol. Mass.386.4497
SMILESNc1ccnc(c1)N1CCC(CC1)n1c2ncccc2n(-c2ccccc2)c1=O