Reaction Details
TargetCoagulation factor X
LigandBDBM50266772
Substrate/Competitorn/a
Meas. Tech.ChEMBL_563985 (CHEMBL956028)
IC50 1.2±n/a nM
Citation Van Huis, CACasimiro-Garcia, ABigge, CFCody, WLDudley, DAFilipski, KJHeemstra, RJKohrt, JTLeadley, RJNarasimhan, LSMcClanahan, TMochalkin, IPamment, MPeterson, JTSahasrabudhe, VSchaum, RPEdmunds, JJ Exploration of 4,4-disubstituted pyrrolidine-1,2-dicarboxamides as potent, orally active Factor Xa inhibitors with extended duration of action. Bioorg Med Chem17:2501-11 (2009) 
 
Coagulation factor X
Name:Coagulation factor X
Type:Enzyme
Mol. Mass.:54726.60
Organism:Homo sapiens (Human)
Description:n/a
Residue:488
BDBM50266772
NameBDBM50266772
Synonyms:(2R,4S)-N1-(4-Chlorophenyl)-4-hydroxy-N2-(5-(2-oxopyridin-1(2H)-yl)pyridin-2-yl)-4-m-tolylpyrrolidine-1,2-dicarboxamide | CHEMBL475481
TypeSmall organic molecule
Emp. Form.C29H26ClN5O4
Mol. Mass.544.001
SMILESCc1cccc(c1)[C@@]1(O)C[C@@H](N(C1)C(=O)Nc1ccc(Cl)cc1)C(=O)Nc1ccc(cn1)-n1ccccc1=O