Reaction Details
TargetCoagulation factor X
LigandBDBM50266922
Substrate/Competitorn/a
Meas. Tech.ChEMBL_563985 (CHEMBL956028)
IC50 0.16±n/a nM
Citation Van Huis, CACasimiro-Garcia, ABigge, CFCody, WLDudley, DAFilipski, KJHeemstra, RJKohrt, JTLeadley, RJNarasimhan, LSMcClanahan, TMochalkin, IPamment, MPeterson, JTSahasrabudhe, VSchaum, RPEdmunds, JJ Exploration of 4,4-disubstituted pyrrolidine-1,2-dicarboxamides as potent, orally active Factor Xa inhibitors with extended duration of action. Bioorg Med Chem17:2501-11 (2009) 
 
Coagulation factor X
Name:Coagulation factor X
Type:Enzyme
Mol. Mass.:54726.60
Organism:Homo sapiens (Human)
Description:n/a
Residue:488
BDBM50266922
NameBDBM50266922
Synonyms:(2R,4S)-N1-(4-Chlorophenyl)-4-(4-fluorophenyl)-4-hydroxy-N2-(5-(2-oxopyridin-1(2H)-yl)pyridin-2-yl)pyrrolidine-1,2-dicarboxamide | CHEMBL474070
TypeSmall organic molecule
Emp. Form.C28H23ClFN5O4
Mol. Mass.547.965
SMILESO[C@@]1(C[C@@H](N(C1)C(=O)Nc1ccc(Cl)cc1)C(=O)Nc1ccc(cn1)-n1ccccc1=O)c1ccc(F)cc1