Reaction Details
TargetNeuronal acetylcholine receptor subunit alpha-3
LigandBDBM50062641
Substrate/Competitorn/a
Meas. Tech.ChEMBL_565982 (CHEMBL964081)
EC50 190±n/a nM
Citation Sippy, KBAnderson, DJBunnelle, WHHutchins, CWSchrimpf, MR Preparation and characterization of N-(3-pyridinyl) spirocyclic diamines as ligands for nicotinic acetylcholine receptors. Bioorg Med Chem Lett19:1682-5 (2009) 
 
Neuronal acetylcholine receptor subunit alpha-3
Name:Neuronal acetylcholine receptor subunit alpha-3
Type:Enzyme Catalytic Domain
Mol. Mass.:57479.03
Organism:Homo sapiens (Human)
Description:Cholinergic, Nicotinic Alpha3Beta2 0 HUMAN::P32297
Residue:505
BDBM50062641
NameBDBM50062641
Synonyms:5-((R)-1-Azetidin-2-ylmethoxy)-2-chloro-pyridine TEBENICILINE | Tebanicline tosylate
TypeSmall organic molecule
Emp. Form.C9H11ClN2O
Mol. Mass.198.649
SMILESClc1ccc(OC[C@H]2CCN2)cn1