Reaction Details
TargetReplicase polyprotein 1ab
LigandBDBM50258134
Substrate/Competitorn/a
Meas. Tech.ChEMBL_566014 (CHEMBL964113)
IC50 13600±n/a nM
Citation Lee, CLee, JMLee, NRJin, BSJang, KJKim, DEJeong, YJChong, Y Aryl diketoacids (ADK) selectively inhibit duplex DNA-unwinding activity of SARS coronavirus NTPase/helicase. Bioorg Med Chem Lett19:1636-8 (2009) 
 
Replicase polyprotein 1ab
Name:Replicase polyprotein 1ab
Type:Protein
Mol. Mass.:790250.81
Organism:Human SARS coronavirus (SARS-CoV) (Severe acute respiratory syndrome coronavirus)
Description:P0C6X7
Residue:7073
BDBM50258134
NameBDBM50258134
Synonyms:4-(3-(4-chlorobenzyloxy)phenyl)-2-hydroxy-4-oxobut-2-enoic acid | CHEMBL492771
TypeSmall organic molecule
Emp. Form.C17H13ClO5
Mol. Mass.332.735
SMILESOC(=O)C(=O)CC(=O)c1cccc(OCc2ccc(Cl)cc2)c1