Reaction Details
TargetC-C chemokine receptor type 5
LigandBDBM50257737
Substrate/Competitorn/a
Meas. Tech.ChEMBL_566336 (CHEMBL956846)
IC50 0.9±n/a nM
Citation Duan, MAquino, CFerris, RKazmierski, WMKenakin, TKoble, CWheelan, PWatson, CYoungman, M [2-(4-Phenyl-4-piperidinyl)ethyl]amine based CCR5 antagonists: derivatizations at the N-terminal of the piperidine ring. Bioorg Med Chem Lett19:1610-3 (2009) 
 
C-C chemokine receptor type 5
Name:C-C chemokine receptor type 5
Type:Enzyme
Mol. Mass.:40540.21
Organism:Homo sapiens (Human)
Description:P51681
Residue:352
BDBM50257737
NameBDBM50257737
Synonyms:CHEMBL444497 | methyl 2-(4-fluorophenyl)-2-(4-(2-(3-(2-methyl-1H-benzo[d]imidazol-1-yl)-8-azabicyclo[3.2.1]octan-8-yl)ethyl)-4-phenylpiperidin-1-yl)acetate
TypeSmall organic molecule
Emp. Form.C37H43FN4O2
Mol. Mass.594.7613
SMILESCOC(=O)C(N1CCC(CCN2[C@H]3CC[C@@H]2C[C@@H](C3)n2c(C)nc3ccccc23)(CC1)c1ccccc1)c1ccc(F)cc1