Reaction Details
TargetGlucocorticoid receptor
LigandBDBM50276126
Substrate/Competitorn/a
Meas. Tech.ChEMBL_542867 (CHEMBL1022144)
IC50 2.5±n/a nM
Citation Robinson, RPBuckbinder, LHaugeto, AIMcNiff, PAMillham, MLReese, MRSchaefer, JFAbramov, YABordner, JChantigny, YAKleinman, EFLaird, ERMorgan, BPMurray, JCSalter, EDWessel, MDYocum, SA Octahydrophenanthrene-2,7-diol analogues as dissociated glucocorticoid receptor agonists: discovery and lead exploration. J Med Chem52:1731-43 (2009) 
 
Glucocorticoid receptor
Name:Glucocorticoid receptor
Type:Enzyme
Mol. Mass.:85656.87
Organism:Homo sapiens (Human)
Description:P04150
Residue:777
BDBM50276126
NameBDBM50276126
Synonyms:(2R,3S,4aR,10aR)-4a-Ethyl-2-phenyl-1,2,3,4,4a,9,10,10a-octahydrophenanthrene-2,3,7-triol | CHEMBL511812
TypeSmall organic molecule
Emp. Form.C22H26O3
Mol. Mass.338.44
SMILESCC[C@@]12C[C@H](O)[C@@](O)(C[C@H]1CCc1cc(O)ccc21)c1ccccc1