Reaction Details
TargetSigma non-opioid intracellular receptor 1
LigandBDBM50257493
Substrate/Competitorn/a
Meas. Tech.ChEMBL_566709 (CHEMBL961701)
Ki 12±n/a nM
Citation Holl, RSchepmann, DFröhlich, RGrünert, RBednarski, PJWünsch, B Dancing of the second aromatic residue around the 6,8-diazabicyclo[3.2.2]nonane framework: influence on sigma receptor affinity and cytotoxicity. J Med Chem52:2126-37 (2009) 
 
Sigma non-opioid intracellular receptor 1
Name:Sigma non-opioid intracellular receptor 1
Type:Enzyme Catalytic Domain
Mol. Mass.:25124.85
Organism:Homo sapiens (Human)
Description:Q99720
Residue:223
BDBM50257493
NameBDBM50257493
Synonyms:(R)-(1-benzyl-4-(4-methoxybenzyl)piperazin-2-yl)methanol | CHEMBL502377
TypeSmall organic molecule
Emp. Form.C20H26N2O2
Mol. Mass.326.4326
SMILESCOc1ccc(CN2CCN(Cc3ccccc3)[C@@H](CO)C2)cc1