Reaction Details
TargetNeuropeptide Y receptor type 5
LigandBDBM50258232
Substrate/Competitorn/a
Meas. Tech.ChEMBL_567024 (CHEMBL1029921)
IC50 0.57±n/a nM
Citation Sakamoto, TMoriya, MHaga, YTakahashi, TShibata, TOkamoto, ONonoshita, KKitazawa, HHidaka, MGomori, AIwaasa, HIshihara, AKanatani, AFukami, TGao, YDMacneil, DJYang, L Identification of novel and orally active spiroindoline NPY Y5 receptor antagonists. Bioorg Med Chem Lett19:1564-8 (2009) 
 
Neuropeptide Y receptor type 5
Name:Neuropeptide Y receptor type 5
Type:Enzyme
Mol. Mass.:50746.64
Organism:Homo sapiens (Human)
Description:Q15761
Residue:445
BDBM50258232
NameBDBM50258232
Synonyms:1-(Methylsulfonyl)-N-(5-phenylpyrimidin-2-yl)-1,2-dihydro-1'H-spiro[indole-3,4'-piperidine]-1'-carboxamide CHEMBL495169
TypeSmall organic molecule
Emp. Form.C24H25N5O3S
Mol. Mass.463.552
SMILESCS(=O)(=O)N1CC2(CCN(CC2)C(=O)Nc2ncc(cn2)-c2ccccc2)c2ccccc12