Reaction Details
TargetCannabinoid receptor 2
LigandBDBM50257851
Substrate/Competitorn/a
Meas. Tech.ChEMBL_567044 (CHEMBL1029952)
Ki 312±n/a nM
Citation Zindell, RRiether, DBosanac, TBerry, AGemkow, MJEbneth, ALöbbe, SRaymond, ELThome, DShih, DTThomson, D Morpholine containing CB2 selective agonists. Bioorg Med Chem Lett19:1604-9 (2009) 
 
Cannabinoid receptor 2
Name:Cannabinoid receptor 2
Type:G Protein-Coupled Receptor (GPCR)
Mol. Mass.:39690.94
Organism:Homo sapiens (Human)
Description:P34972
Residue:360
BDBM50257851
NameBDBM50257851
Synonyms:(S)-4-((2',3'-dichlorobiphenyl-4-yl)methyl)-2-phenylmorpholine | CHEMBL494994
TypeSmall organic molecule
Emp. Form.C23H21Cl2NO
Mol. Mass.398.325
SMILESClc1cccc(c1Cl)-c1ccc(CN2CCO[C@H](C2)c2ccccc2)cc1