Reaction Details
TargetTyrosine-protein kinase ITK/TSK
LigandBDBM50257918
Substrate/Competitorn/a
Meas. Tech.ChEMBL_562393 (CHEMBL1018826)
IC50 1±n/a nM
Citation Riether, DZindell, RKowalski, JACook, BNBentzien, JLombaert, SDThomson, DKugler, SZSkow, DMartin, LSRaymond, ELKhine, HHO'Shea, KWoska, JRJeanfavre, DSellati, RRalph, KLAhlberg, JLabissiere, GKashem, MAPullen, SSTakahashi, H 5-Aminomethylbenzimidazoles as potent ITK antagonists. Bioorg Med Chem Lett19:1588-91 (2009) 
 
Tyrosine-protein kinase ITK/TSK
Name:Tyrosine-protein kinase ITK/TSK
Type:Protein
Mol. Mass.:71839.20
Organism:Homo sapiens (Human)
Description:Q08881
Residue:620
BDBM50257918
NameBDBM50257918
Synonyms:CHEMBL522682 | N-(5-((3,5-dimethylmorpholino)methyl)-1-(2-hydroxy-2-methylpropyl)-1H-benzo[d]imidazol-2(3H)-ylidene)-5-(1H-pyrazol-4-yl)thiophene-2-carboxamide
TypeSmall organic molecule
Emp. Form.C26H32N6O3S
Mol. Mass.508.636
SMILESCC1COCC(C)N1Cc1ccc2n(CC(C)(C)O)c(NC(=O)c3ccc(s3)-c3cn[nH]c3)nc2c1