Reaction Details
TargetCannabinoid receptor 2
LigandBDBM50244320
Substrate/Competitorn/a
Meas. Tech.ChEMBL_564385 (CHEMBL962380)
Ki 7.83±n/a nM
Citation Ferreira, AMKrishnamurthy, MMoore, BMFinkelstein, DBashford, D Quantitative structure-activity relationship (QSAR) for a series of novel cannabinoid derivatives using descriptors derived from semi-empirical quantum-chemical calculations. Bioorg Med Chem17:2598-606 (2009) 
 
Cannabinoid receptor 2
Name:Cannabinoid receptor 2
Type:G Protein-Coupled Receptor (GPCR)
Mol. Mass.:39690.94
Organism:Homo sapiens (Human)
Description:P34972
Residue:360
BDBM50244320
NameBDBM50244320
Synonyms:(6aR,10aR)-6,6,9-trimethyl-3-(2-(4-propylphenyl)propan-2-yl)-6a,7,10,10a-tetrahydro-6H-benzo[c]chromen-1-ol CHEMBL471122
TypeSmall organic molecule
Emp. Form.C28H36O2
Mol. Mass.404.5842
SMILESCCCc1ccc(cc1)C(C)(C)c1cc(O)c2[C@@H]3CC(C)=CC[C@H]3C(C)(C)Oc2c1