Reaction Details
TargetCannabinoid receptor 1
LigandBDBM50244320
Substrate/Competitorn/a
Meas. Tech.ChEMBL_564384 (CHEMBL962379)
Ki 1.77±n/a nM
Citation Ferreira, AMKrishnamurthy, MMoore, BMFinkelstein, DBashford, D Quantitative structure-activity relationship (QSAR) for a series of novel cannabinoid derivatives using descriptors derived from semi-empirical quantum-chemical calculations. Bioorg Med Chem17:2598-606 (2009) 
 
Cannabinoid receptor 1
Name:Cannabinoid receptor 1
Type:G Protein-Coupled Receptor (GPCR)
Mol. Mass.:52868.96
Organism:Homo sapiens (Human)
Description:P21554
Residue:472
BDBM50244320
NameBDBM50244320
Synonyms:(6aR,10aR)-6,6,9-trimethyl-3-(2-(4-propylphenyl)propan-2-yl)-6a,7,10,10a-tetrahydro-6H-benzo[c]chromen-1-ol CHEMBL471122
TypeSmall organic molecule
Emp. Form.C28H36O2
Mol. Mass.404.5842
SMILESCCCc1ccc(cc1)C(C)(C)c1cc(O)c2[C@@H]3CC(C)=CC[C@H]3C(C)(C)Oc2c1