Reaction Details
TargetCannabinoid receptor 1
LigandBDBM50243718
Substrate/Competitorn/a
Meas. Tech.ChEMBL_564384 (CHEMBL962379)
Ki 2.72±n/a nM
Citation Ferreira, AMKrishnamurthy, MMoore, BMFinkelstein, DBashford, D Quantitative structure-activity relationship (QSAR) for a series of novel cannabinoid derivatives using descriptors derived from semi-empirical quantum-chemical calculations. Bioorg Med Chem17:2598-606 (2009) 
 
Cannabinoid receptor 1
Name:Cannabinoid receptor 1
Type:G Protein-Coupled Receptor (GPCR)
Mol. Mass.:52868.96
Organism:Homo sapiens (Human)
Description:P21554
Residue:472
BDBM50243718
NameBDBM50243718
Synonyms:3-(2-((6aR,10aR)-1-hydroxy-6,6,9-trimethyl-6a,7,10,10a-tetrahydro-6H-benzo[c]chromen-3-yl)propan-2-yl)benzonitrile CHEMBL471366 | KM-233
TypeSmall organic molecule
Emp. Form.C26H29NO2
Mol. Mass.387.514
SMILESCC1=CC[C@@H]2[C@@H](C1)c1c(O)cc(cc1OC2(C)C)C(C)(C)c1cccc(c1)C#N