Reaction Details
TargetKappa-type opioid receptor
LigandBDBM50248826
Substrate/Competitorn/a
Meas. Tech.ChEMBL_543312 (CHEMBL1019449)
EC50 0.95±n/a nM
Citation Cami-Kobeci, GNeal, APBradbury, FAPurington, LCAceto, MDHarris, LSLewis, JWTraynor, JRHusbands, SM Mixed kappa/mu opioid receptor agonists: the 6 beta-naltrexamines. J Med Chem52:1546-52 (2009) 
 
Kappa-type opioid receptor
Name:Kappa-type opioid receptor
Type:G Protein-Coupled Receptor (GPCR)
Mol. Mass.:42648.76
Organism:Homo sapiens (Human)
Description:P41145
Residue:380
BDBM50248826
NameBDBM50248826
Synonyms:(2E)-N-[(1S,5R,13R,14R,17S)-4-(cyclopropylmethyl)-10,17-dihydroxy-12-oxa-4-azapentacyclo[9.6.1.0^{1,13}.0^{5,17}.0^{7,18}]octadeca-7(18),8,10-trien-14-yl]-3-(2-methoxyphenyl)prop-2-enamide | CHEMBL513598
TypeSmall organic molecule
Emp. Form.C30H34N2O5
Mol. Mass.502.6014
SMILESCOc1ccccc1\C=C\C(=O)N[C@@H]1CC[C@@]2(O)[C@H]3Cc4ccc(O)c5O[C@@H]1[C@]2(CCN3CC1CC1)c45