Reaction Details
TargetMu-type opioid receptor
LigandBDBM50248855
Substrate/Competitorn/a
Meas. Tech.ChEMBL_543310 (CHEMBL1019447)
EC50 1±n/a nM
Citation Cami-Kobeci, GNeal, APBradbury, FAPurington, LCAceto, MDHarris, LSLewis, JWTraynor, JRHusbands, SM Mixed kappa/mu opioid receptor agonists: the 6 beta-naltrexamines. J Med Chem52:1546-52 (2009) 
 
Mu-type opioid receptor
Name:Mu-type opioid receptor
Type:G Protein-Coupled Receptor (GPCR)
Mol. Mass.:44503.11
Organism:Rattus norvegicus (rat)
Description:Competition binding assays were carried out using membrane preparations from transfected HN9.10 cells that constitutively expressed the mu opioid receptor.
Residue:398
BDBM50248855
NameBDBM50248855
Synonyms:14beta-Acetoyloxy-17-cyclopropylmethyl-4,5alpha-epoxy-3-hydroxy-6beta-(cinnamoylamino)morphinan | CHEMBL472583
TypeSmall organic molecule
Emp. Form.C31H34N2O5
Mol. Mass.514.6121
SMILESCC(=O)O[C@]12CC[C@@H](NC(=O)\C=C\c3ccccc3)[C@@H]3Oc4c5c(C[C@H]1N(CC1CC1)CC[C@@]235)ccc4O